2-(7Z)-Bisaboladien-4-ol
- Formula: C15H26O
- Molecular weight: 222.3663
- IUPAC Standard InChIKey: VPQVBGZEPDUZFM-WAYWQWQTSA-N
- Chemical structure:

Normal alkane RI, non-polar column, temperature ramp

Column type | Active phase | I | Reference | Comment |
---|---|---|---|---|
Capillary | HP-5 MS | 1619. | Phungpanya, Thongpoon, et al., 2012 | 30. m/0.25 mm/0.25 μm, Helium, 2. K/min; Tstart: 50. C; Tend: 180. C |

References

Phungpanya, Thongpoon, et al., 2012
Phungpanya, C.; Thongpoon, C.; Pripdeevech, P.; Machan, T.,
Analysis of aroma volatiles from fresh leaves of Plectranthus amboinicus using solid phase microextraction (SPME) technique, Pure and Applied Chemistry International Conference 2012 (PACCON 2012), 2012, 16701672. [all data]