1-Diazo-3-methylbutan-2-one

Normal alkane RI, non-polar column, temperature ramp

View large format table.

Column type Active phase I Reference Comment
CapillaryHP-5 MS889.Kornilova, Ukolov, et al., 201225. m/0.20 mm/0.33 μm, Helium, 45. C @ 1. min, 5. K/min, 280. C @ 2. min
CapillaryHP-5 MS918.Kornilova, Ukolov, et al., 201225. m/0.20 mm/0.33 μm, Helium, 45. C @ 1. min, 5. K/min, 280. C @ 2. min

References

Kornilova, Ukolov, et al., 2012
Kornilova, T.A.; Ukolov, A.I.; Kostikov, R.R.; Zenkevich, I.G., Stability of diazocarbonyl compounds under the conditions of gas chromatography and chromatography-mass spectrometry analysis, Rus. J. General Chem., 2012, 82, 10, 1675-1685, https://doi.org/10.1134/S1070363212100088 . [all data]