(Z,E)-Matricaria ester

Normal alkane RI, non-polar column, temperature ramp

View large format table.

Column type Active phase I Reference Comment
CapillaryHP-5 MS1527.Jian-Yu, Zhu, et al., 201230. m/0.25 mm/0.25 μm, Helium, 40. C @ 1. min, 3. K/min, 250. C @ 3. min

References

Jian-Yu, Zhu, et al., 2012
Jian-Yu, S.; Zhu, L.; Tian, Y.-J., Chemical composition and antimicrobial activities of essential oil of Matricaria songarica, Int. J. Agriculture Biology, 2012, 14, 1, 107-110. [all data]