Glycine, TMS

Normal alkane RI, non-polar column, temperature ramp

Data compiled by: NIST Mass Spectrometry Data Center, William E. Wallace, director

Column type Capillary
Active phase HP-5 MS
Column length (m) 30.
Carrier gas
Substrate
Column diameter (mm) 0.25
Phase thickness (μm) 0.25
Tstart (C) 80.
Tend (C) 320.
Heat rate (K/min) 5.
Initial hold (min)
Final hold (min)
I 1328.
ReferenceErxleben, Gessler, et al., 2012
Comment MSDC-RI

References

Erxleben, Gessler, et al., 2012
Erxleben, A.; Gessler, A.; Vervliet-Scheebaum, M.; Reski, R., Metabolite profiling of the moss Physcomitrella patens reveals evolutionary conservation of osmoprotective substances, Plant Cell Rep., 2012, 31, 2, 427-436, https://doi.org/10.1007/s00299-011-1177-9 . [all data]