Glycolic acid, TMS

Normal alkane RI, non-polar column, temperature ramp

View large format table.

Column type Active phase I Reference Comment
CapillaryHP-5 MS1997.Erxleben, Gessler, et al., 201230. m/0.25 mm/0.25 μm, 5. K/min; Tstart: 80. C; Tend: 320. C

References

Erxleben, Gessler, et al., 2012
Erxleben, A.; Gessler, A.; Vervliet-Scheebaum, M.; Reski, R., Metabolite profiling of the moss Physcomitrella patens reveals evolutionary conservation of osmoprotective substances, Plant Cell Rep., 2012, 31, 2, 427-436, https://doi.org/10.1007/s00299-011-1177-9 . [all data]