bis-[3,3-(2-Methylpropanol-1)] disulfide

Van Den Dool and Kratz RI, non-polar column, temperature ramp

View large format table.

Column type Active phase I Reference Comment
CapillaryOV-1011660.Misharina, Aerove, et al., 199150. m/0.32 mm/0.50 μm, He, 2. K/min; Tstart: 50. C; Tend: 250. C

References

Misharina, Aerove, et al., 1991
Misharina, T.A.; Aerove, A.F.; Golovnya, R.E.; Kalugina, V.I.; Rogovskaya, L.V.; Vysotskaya, L.E.; Shevtsov, V.K., Identification of volatile components of an aromatizer with a chicken odor by chromatography-mass spectrometry and chromatography-fourier transform infrared spectroscopy, J. Anal. Chem. USSR (Engl. Transl.), 1991, 8, 1187-1193. [all data]