Dihydrodehydro-α-ionone

Normal alkane RI, non-polar column, custom temperature program

View large format table.

Column type Active phase I Reference Comment
CapillaryCP-Sil 5 CB1419.Collin, Nizet, et al., 201250. m/0.32 mm/1.20 μm, Nitrogen; Program: 36 0C 20 0C/min -> 85 0C 1 0C/min -> 145 0C 3 0C/min -> 250 0C

References

Collin, Nizet, et al., 2012
Collin, S.; Nizet, S.; Bouuaert, T.C.; Despartures, P.-M., MAin odorants in Jura Flor-Sherry wines. Relative contributions of sotolon, abhexon, and theaspirane-derived compounds, J. Agr. Food Chem., 2012, 60, 1, 380-381, https://doi.org/10.1021/jf203832c . [all data]