4-Dodecanone, 3,5-dichloro (RR, SS)

Normal alkane RI, non-polar column, temperature ramp

Data compiled by: NIST Mass Spectrometry Data Center, William E. Wallace, director

Column type Capillary
Active phase OV-101
Column length (m) 25.
Carrier gas Nitrogen
Substrate
Column diameter (mm) 0.20
Phase thickness (μm) 0.25
Tstart (C) 40.
Tend (C) 240.
Heat rate (K/min) 6.
Initial hold (min)
Final hold (min)
I 1600.
ReferenceZenkevich, Eliseenkov, et al., 2011
Comment MSDC-RI

References

Zenkevich, Eliseenkov, et al., 2011
Zenkevich, I.G.; Eliseenkov, E.V.; Kasatochkin, A.N.; Zhakovskaya, Z.A.; Khoroshko, L.O., Gas chromatographic identification of chlorination products of aliphatic ketones, J. Chromatogr., 2011, 1218, 21, 3291-3299, https://doi.org/10.1016/j.chroma.2010.12.056 . [all data]