Cosmene
- Formula: C10H14
- Molecular weight: 134.2182
- IUPAC Standard InChIKey: HPZWSJQQCJZBBG-QDJLDCPTSA-N
- Chemical structure:

Normal alkane RI, non-polar column, custom temperature program

Column type | Active phase | I | Reference | Comment |
---|---|---|---|---|
Capillary | HP-5 | 1130. | Wang, Liu, et al., 2011 | 30. m/0.25 mm/0.25 μm, Helium; Program: 60 0C (1 min) 10 0C/min -> 180 0C (1 min) 20 0C/min -> 280 0C (15 min) |

References

Wang, Liu, et al., 2011
Wang, C.F.; Liu, P.; Yang, K.; Zeng, Y.; Liu, Z.L.; Du, S.S.; Deng, Z.W.,
Chemical composition and toxicities of essential oil of Illicium fragesil fruits against Sitophilis zeamais,
African J. Biotechnol., 2011, 10, 79, 18179-18184. [all data]