6-Hydroxy-α-humulene

Normal alkane RI, non-polar column, temperature ramp

View large format table.

Column type Active phase I Reference Comment
CapillaryHP-5 MS1656.Vedernikov and Roschin, 201130. m/0.25 mm/0.25 μm, Helium, 5. K/min, 280. C @ 10. min; Tstart: 100. C

References

Vedernikov and Roschin, 2011
Vedernikov, D.N.; Roschin, V.I., Humulene and its derivatives from Betula pendula buds, Chem. Nat. Comp., 2011, 46, 6, 886-891, https://doi.org/10.1007/s10600-011-9775-x . [all data]