β-Nerolidol

Normal alkane RI, polar column, temperature ramp

View large format table.

Column type Active phase I Reference Comment
CapillaryDB-FFAP2054.Osorio, Carriazo, et al., 201130. m/0.32 mm/0.25 μm, Helium, 50. C @ 4. min, 4. K/min, 250. C @ 5. min

References

Osorio, Carriazo, et al., 2011
Osorio, C.; Carriazo, J.G.; Barbosa, H., Thermal and structural study of Guava (Psidium guajava L.) powders obtained by two dehydration methods, Quim. Nova, 2011, 34, 4, 636-640, https://doi.org/10.1590/S0100-40422011000400016 . [all data]