α-Humulene hydrate

Normal alkane RI, non-polar column, custom temperature program

View large format table.

Column type Active phase I Reference Comment
CapillaryHP-5 MS1597.Nance and Setzer, 201130. m/0.25 mm/0.25 μm, Helium; Program: 40 0C (10 min) 3 0C/min -> 200 0C 2 0C/min -> 220 0C

References

Nance and Setzer, 2011
Nance, M.R.; Setzer, W.N., Volatile components of aroma hops (Humulus lupulus L.) commonly used in beer brewing, J. of Brewing and Distilling, 2011, 2, 2, 16-22. [all data]