Galaxolide

Normal alkane RI, non-polar column, temperature ramp

Data compiled by: NIST Mass Spectrometry Data Center, William E. Wallace, director

Column type Capillary
Active phase CP-Sil 5 CB
Column length (m) 30.
Carrier gas Nitrogen
Substrate
Column diameter (mm) 0.25
Phase thickness (μm) 0.26
Tstart (C) 45.
Tend (C) 280.
Heat rate (K/min) 3.
Initial hold (min)
Final hold (min) 22.
I 1837.
ReferenceMothana, Hasson, et al., 2011
Comment MSDC-RI

References

Mothana, Hasson, et al., 2011
Mothana, R.A.A.; Hasson, S.S.; Schultze, W.; Mowitz, A.; Lindequist, U., Phytochemical composition and in vitro antimicrobial and antioxidant activities of essential oils of three endemic Soqotraen Boswellia species, Food Chem., 2011, 126, 3, 1149-1154, https://doi.org/10.1016/j.foodchem.2010.11.150 . [all data]