Pyrrolidino[1,2-e]-4H-1,3,5-dithiazine, 4-methyl-2-(2-methylpropyl)

Normal alkane RI, non-polar column, custom temperature program

View large format table.

Column type Active phase I Reference Comment
CapillaryDB-11703.Kawai, Ishida, et al., 199160. m/0.25 mm/0.25 μm; Program: not specified

References

Kawai, Ishida, et al., 1991
Kawai, T.; Ishida, Y.; Kakiuchi, H.; Ikeda, N.; Higashida, T.; Nakamura, S., Flavor components of dried squid, J. Agric. Food Chem., 1991, 39, 4, 770-777, https://doi.org/10.1021/jf00004a031 . [all data]