pyrrolidino[1,2-e]-4H-2,4-dimethyl-1,3,5-dithiazine

Normal alkane RI, non-polar column, custom temperature program

View large format table.

Column type Active phase I Reference Comment
CapillaryDB-11462.Kawai, Ishida, et al., 199160. m/0.25 mm/0.25 μm; Program: not specified
CapillaryDB-11462.Kawai, Ishida, et al., 199160. m/0.25 mm/0.25 μm; Program: not specified

Normal alkane RI, polar column, temperature ramp

View large format table.

Column type Active phase I Reference Comment
CapillaryPEG-20M1990.Kubota, Nakamoto, et al., 1991N2, 2. K/min; Column length: 50. m; Column diameter: 0.25 mm; Tstart: 60. C; Tend: 180. C

References

Kawai, Ishida, et al., 1991
Kawai, T.; Ishida, Y.; Kakiuchi, H.; Ikeda, N.; Higashida, T.; Nakamura, S., Flavor components of dried squid, J. Agric. Food Chem., 1991, 39, 4, 770-777, https://doi.org/10.1021/jf00004a031 . [all data]

Kubota, Nakamoto, et al., 1991
Kubota, K.; Nakamoto, A.; Moriguchi, M.; Kobayashi, A.; Ishii, H., Formation of pyrrolidino[1,2-e]-4H-2,4-dimethyl-1,3,5-dithiazine in the volatiles of boiled short-necked clam, clam, and corbicula, J. Agric. Food Chem., 1991, 39, 6, 1127-1130, https://doi.org/10.1021/jf00006a027 . [all data]