Aniline, 2-bromo-6-chloro

Normal alkane RI, non-polar column, temperature ramp

View large format table.

Column type Active phase I Reference Comment
CapillaryTR-11284.Gruzdev, Alferova, et al., 201130. m/0.32 mm/0.25 μm, Helium, 5. K/min; Tstart: 50. C; Tend: 300. C
CapillaryTR-11286.Gruzdev, Alferova, et al., 201130. m/0.32 mm/0.25 μm, Helium, 5. K/min; Tstart: 50. C; Tend: 300. C

References

Gruzdev, Alferova, et al., 2011
Gruzdev, I.V.; Alferova, M.V.; Kondratenok, B.M.; Zenkevich, I.G., Gas-chromatographic identification of chloro- and bromosubstituted anilines using retention indices, Rus. J. Anal. Chem., 2011, 66, 5, 519-524. [all data]