3-Sulfanylbutyl acetate

Normal alkane RI, non-polar column, custom temperature program

View large format table.

Column type Active phase I Reference Comment
CapillaryCP-Sil 5 CB1033.Gros, Nizet, et al., 201150. m/0.32 mm/1.20 μm, Nitrogen; Program: 36 0C 20 0C/min -> 85 0C 1 0C/min -> 145 0C 3 0C/min -> 250 0C (30 min)

Normal alkane RI, polar column, custom temperature program

View large format table.

Column type Active phase I Reference Comment
CapillaryFFAP1536.Gros, Nizet, et al., 201125. m/0.32 mm/0.30 μm, Nitrogen; Program: 36 0C 20 0C/min -> 85 0C 1 0C/min -> 145 0C 3 0C/min -> 250 0C (30 min)

References

Gros, Nizet, et al., 2011
Gros, J.; Nizet, S.; Collin, S., Occurence of odorant polyfunctional thiols in the Super Alpha Tomahawk Hop cultivar. Comparison with the thiol-rich Nelson Sauvin bitter variety, J. Agric. Food Chem., 2011, 59, 16, 8853-8865, https://doi.org/10.1021/jf201294e . [all data]