3-Sulfanyl-2-butylpropan-1-ol

Normal alkane RI, non-polar column, custom temperature program

Data compiled by: NIST Mass Spectrometry Data Center, William E. Wallace, director

Column type Capillary
Active phase CP-Sil 5 CB
Column length (m) 50.
Carrier gas Nitrogen
Substrate
Column diameter (mm) 0.32
Phase thickness (μm) 1.20
Program 36 0C 20 0C/min -> 85 0C 1 0C/min -> 145 0C 3 0C/min -> 250 0C (30 min)
I 1191.
ReferenceGros, Nizet, et al., 2011
Comment MSDC-RI

References

Gros, Nizet, et al., 2011
Gros, J.; Nizet, S.; Collin, S., Occurence of odorant polyfunctional thiols in the Super Alpha Tomahawk Hop cultivar. Comparison with the thiol-rich Nelson Sauvin bitter variety, J. Agric. Food Chem., 2011, 59, 16, 8853-8865, https://doi.org/10.1021/jf201294e . [all data]