Selin-11-en-4-ol

Normal alkane RI, non-polar column, custom temperature program

Data compiled by: NIST Mass Spectrometry Data Center, William E. Wallace, director

Column type Capillary
Active phase 5 % Phenyl polydimethyl siloxane
Column length (m)
Carrier gas
Substrate
Column diameter (mm)
Phase thickness (μm)
Program not specified
I 1661.
ReferenceChaverri, Diaz, et al., 2011
Comment MSDC-RI

References

Chaverri, Diaz, et al., 2011
Chaverri, C.; Diaz, C.; Cicco, J.F., Chemical analysis of essential oils from Ocotea gomezii W.C. Burger and Ocotea morae Gomez-Laur. (Lauraceae) collected at Reserva biologica Alberto M. Brenes in Costa Rica and their cytotoxic activity on Tumor cell lines, J. Braz. Chem. Soc., 2011, 22, 4, s1-s4, https://doi.org/10.1590/S0103-50532011000400018 . [all data]