(E,Z)-β-Farnesene

Normal alkane RI, non-polar column, temperature ramp

View large format table.

Column type Active phase I Reference Comment
CapillarySE-541455.Buono-Core, Nunez, et al., 201130. m/0.25 mm/0.25 μm, Helium, 80. C @ 2. min, 10. K/min, 250. C @ 10. min

References

Buono-Core, Nunez, et al., 2011
Buono-Core, G.E.; Nunez, M.V.; Lucero, A.; Vargas, R.; Jullian, C., Structural elucidation of bioactive principles in floral extracts of German chamomille (Matricaria recituta L.), J. Chil. Chem. Soc., 2011, 56, 1, 549-553, https://doi.org/10.4067/S0717-97072011000100006 . [all data]