(6R)-Hydroxy-α-humulene

Normal alkane RI, non-polar column, temperature ramp

Data compiled by: NIST Mass Spectrometry Data Center, William E. Wallace, director

Column type Capillary
Active phase HP-5 MS
Column length (m) 30.
Carrier gas Helium
Substrate
Column diameter (mm) 0.25
Phase thickness (μm) 0.25
Tstart (C) 100.
Tend (C) 280.
Heat rate (K/min) 5.
Initial hold (min)
Final hold (min)
I 1657.
ReferenceVedernikov and Roschin, 2010
Comment MSDC-RI

References

Vedernikov and Roschin, 2010
Vedernikov, D.N.; Roschin, V.I., Extractive compounds of Birch buds (Betula pendula Roth.): II. Carbonyl compounds and oxides. Esters, Rus. J. Bioorg. Chem., 2010, 36, 7, 899-908, https://doi.org/10.1134/S1068162010070186 . [all data]