14-Hydroxy-β-caryophyllene

Normal alkane RI, non-polar column, temperature ramp

View large format table.

Column type Active phase I Reference Comment
CapillaryHP-5 MS1702.Vedernikov and Roschin, 201030. m/0.25 mm/0.25 μm, Helium, 5. K/min; Tstart: 100. C; Tend: 280. C

References

Vedernikov and Roschin, 2010
Vedernikov, D.N.; Roschin, V.I., Extractive compounds of Birch buds (Betula pendula Roth.): II. Carbonyl compounds and oxides. Esters, Rus. J. Bioorg. Chem., 2010, 36, 7, 899-908, https://doi.org/10.1134/S1068162010070186 . [all data]