(Z)-α-Farnesene

Normal alkane RI, non-polar column, temperature ramp

View large format table.

Column type Active phase I Reference Comment
CapillaryCP Sil 5 CB1456.Usman, Zubair, et al., 201025. m/0.25 mm/0.15 μm, 3. K/min; Tstart: 50. C; Tend: 230. C

References

Usman, Zubair, et al., 2010
Usman, L.A.; Zubair, M.F.; Adabayo, S.A.; Oladosu, I.A.; Muhammad, N.O.; Akolade, J.O., Chemical composition of leaf and fruit essential oils of Hoslundia opposita Vahl grown in Nigeria, Americal-Eurasian J. Agric. Environ. Sci., 2010, 8, 1, 40-43. [all data]