Oxazole, 4-ethyl-5-propyl

Kovats' RI, non-polar column, isothermal

View large format table.

Column type Active phase Temperature (C) I Reference Comment
CapillaryOV-101110.1024.Golovnya, Zhuravleva, et al., 199150. m/0.30 mm/0.4 μm, He

Kovats' RI, polar column, isothermal

View large format table.

Column type Active phase Temperature (C) I Reference Comment
CapillaryPEG-40M110.1347.Golovnya, Zhuravleva, et al., 199150. m/0.30 mm/0.4 μm, He

References

Golovnya, Zhuravleva, et al., 1991
Golovnya, R.V.; Zhuravleva, I.L.; Yakush, E.V.; Schenderjuk, V.V., Retentions of alkyloxazoles and alkythiazoles and their prediction based on non-linear additivity concepts in gas chromatography, J. Chromatogr., 1991, 552, 1-12, https://doi.org/10.1016/S0021-9673(01)95918-7 . [all data]