cis-(Z)-α-Bisabolene epoxide

Normal alkane RI, polar column, custom temperature program

Data compiled by: NIST Mass Spectrometry Data Center, William E. Wallace, director

Column type Capillary
Active phase HP-Innowax
Column length (m) 30.
Carrier gas Helium
Substrate
Column diameter (mm) 0.32
Phase thickness (μm) 0.50
Program 50 0C (5 min) 3 0C/min -> 210 0C (10 min) 3 0C/min -> 230 0C
I 1814.
ReferenceSun, Hua, et al., 2010
Comment MSDC-RI

References

Sun, Hua, et al., 2010
Sun, Q.-L.; Hua, S.; Ye, J.-H.; Zheng, X.-Q.; Liang, Y.-R., Flavonoids and volatiles in Chrysanthemum morifolium Ramat flower from Tongxiang County in China, Afr. J. Biotechnol., 2010, 9, 25, 3817-3821. [all data]