3-Methyl-1,2-dithiolan-4-one

Normal alkane RI, non-polar column, temperature ramp

View large format table.

Column type Active phase I Reference Comment
CapillaryDB-51071.Shedid, 201030. m/0.25 mm/0.25 μm, Helium, 4. K/min; Tstart: 50. C; Tend: 220. C

References

Shedid, 2010
Shedid, S., Chemical composition and antioxidant activity of Mallard reaction products generated from glutathione or Cysteine/glucose, World Appl. Sci. J., 2010, 9, 10, 1148-1154. [all data]