trans-Muurolol

Normal alkane RI, non-polar column, temperature ramp

Data compiled by: NIST Mass Spectrometry Data Center, William E. Wallace, director

Column type Capillary
Active phase HP-5 MS
Column length (m) 30.
Carrier gas Helium
Substrate
Column diameter (mm) 0.25
Phase thickness (μm) 0.25
Tstart (C) 60.
Tend (C) 220.
Heat rate (K/min) 6.
Initial hold (min) 3.
Final hold (min)
I 1652.
ReferenceSafaei-Ghomi and Batooli, 2010
Comment MSDC-RI

References

Safaei-Ghomi and Batooli, 2010
Safaei-Ghomi, J.; Batooli, H., Determination of bioactive molecules from flowers, leaves, stems and roots of Perovskia abrotanoides Karel growing in central Iran by nano scale injection, Digest J. Nanomaterials Biostructures, 2010, 5, 2, 551-556. [all data]