α-(E)-Bergamotene

Normal alkane RI, non-polar column, temperature ramp

Data compiled by: NIST Mass Spectrometry Data Center, William E. Wallace, director

Column type Capillary
Active phase HP-5 MS
Column length (m) 30.
Carrier gas Helium
Substrate
Column diameter (mm) 0.25
Phase thickness (μm) 0.25
Tstart (C) 100.
Tend (C) 220.
Heat rate (K/min) 2.
Initial hold (min)
Final hold (min)
I 1431.
ReferencePripdeevech, Chumpolsri, et al., 2010
Comment MSDC-RI

References

Pripdeevech, Chumpolsri, et al., 2010
Pripdeevech, P.; Chumpolsri, W.; Suttiarporn, P.; Wongpornchai, S., The chemical composition and antioxidant activities of Basil from Thailand using retention indices and comprehensive two-dimensional gas chromatography, J. Seb. Chem. Soc., 2010, 75, 11, 1503-1513, https://doi.org/10.2298/JSC100203125P . [all data]