Torilenol

Normal alkane RI, polar column, custom temperature program

View large format table.

Column type Active phase I Reference Comment
CapillaryInnowax FSC2278.Akin, Saracoglu, et al., 201260. m/0.25 mm/0.25 μm, Helium; Program: 60 0C (10 min) 4 0C/min -> 220 0C (10 min) 1 oC/min -> 240 0C
CapillaryInnowax FSC2278.Polatoglu, Demirci, et al., 201060. m/0.25 mm/0.25 μm, Helium; Program: 60 0C (10 min) 4 0C/min -> 220 0C (10 min) 1 0C/min -> 240 0C

References

Akin, Saracoglu, et al., 2012
Akin, M.; Saracoglu, H.T.; Demirci, B.; Baser, K.H.C., Chemical composition and antibacterial activity of essential oils from different parts of Buplerum rotundifolium L., Rec. Nat. Prod., 2012, 6, 3, 316-320. [all data]

Polatoglu, Demirci, et al., 2010
Polatoglu, K.; Demirci, F.; Demirci, B.; Goren, N.; Baser, K.H.C., Antimicrobial activity and essential oil composition of a new T. argyrophyllum (C. Koch) Tvzel var. argyrophyllium chemotype, J. Oleo Sci., 2010, 59, 6, 307-313, https://doi.org/10.5650/jos.59.307 . [all data]