Fukinone

Normal alkane RI, non-polar column, temperature ramp

View large format table.

Column type Active phase I Reference Comment
CapillaryHP-51756.Miyazawa, Kawauchi, et al., 201030. m/0.25 mm/0.25 μm, Helium, 4. K/min, 260. C @ 5. min; Tstart: 40. C

Normal alkane RI, polar column, temperature ramp

View large format table.

Column type Active phase I Reference Comment
CapillaryDB-Wax2254.Miyazawa, Kawauchi, et al., 201015. m/0.25 mm/0.25 μm, Helium, 4. K/min, 260. C @ 5. min; Tstart: 40. C

References

Miyazawa, Kawauchi, et al., 2010
Miyazawa, M.; Kawauchi, Y.; Utsumi, Y.; Takahashi, T., Character impact odorants of wild edible plant - Cacalia hastata L. var. orientalis - used in Japanese traditional food, J. Oleo Sci., 2010, 59, 10, 527-533, https://doi.org/10.5650/jos.59.527 . [all data]