Yuzuol

Normal alkane RI, polar column, temperature ramp

Data compiled by: NIST Mass Spectrometry Data Center, William E. Wallace, director

Column type Capillary
Active phase TC-Wax
Column length (m) 60.
Carrier gas Helium
Substrate
Column diameter (mm) 0.25
Phase thickness (μm)
Tstart (C) 40.
Tend (C) 230.
Heat rate (K/min) 3.
Initial hold (min) 3.
Final hold (min)
I 1986.
ReferenceMiyazawa, Fujita, et al., 2010
Comment MSDC-RI

References

Miyazawa, Fujita, et al., 2010
Miyazawa, N.; Fujita, A.; Kubota, K., Aroma character impact compounds in Kinokuni Mandarin Orange (Citrus kinikuni) compared with Satsuma Mandarin Orange, Biosci. Biotechnol. Biochem., 2010, 74, 4, 835-842, https://doi.org/10.1271/bbb.90937 . [all data]