Mephedrone M (Ar-CH2OH), 2Ac

Normal alkane RI, non-polar column, temperature ramp

Data compiled by: NIST Mass Spectrometry Data Center, William E. Wallace, director

Column type Capillary
Active phase HP-1
Column length (m) 12.
Carrier gas
Substrate
Column diameter (mm) 0.20
Phase thickness (μm) 0.33
Tstart (C) 100.
Tend (C) 310.
Heat rate (K/min) 30.
Initial hold (min) 3.
Final hold (min) 8.
I 2345.
ReferenceMeyer, Willheim, et al., 2010
Comment MSDC-RI

References

Meyer, Willheim, et al., 2010
Meyer, M.R.; Willheim, J.; Peters, F.T.; Maurer, H.H., Beta-keto amphetamines: studies on the metabolism of the designer drug mephedrone and toxicological detection of mephedrone, butylone, and methylone in urine using gas chromatography - mass pectrometry, Anal. Bioanal. Chem., 2010, 397, 3, 1225-1233, https://doi.org/10.1007/s00216-010-3636-5 . [all data]