Longicamphenylone

Normal alkane RI, non-polar column, custom temperature program

Data compiled by: NIST Mass Spectrometry Data Center, William E. Wallace, director

Column type Capillary
Active phase HP-5 MS
Column length (m) 30.
Carrier gas Helium
Substrate
Column diameter (mm) 0.25
Phase thickness (μm) 0.25
Program 60 0C (1 min) 10 0C/min -> 180 0C (1 min) 20 0C/min -> 280 0C (15 min)
I 1569.
ReferenceLiu, Chu, et al., 2010
Comment MSDC-RI

References

Liu, Chu, et al., 2010
Liu, Z.L.; Chu, S.S.; Liu, Q.R., Chemical composition and insecticidial activity against Sitophilus zeamais of the essential oils of Artemisia capillaris and Artemisia mongolica, Molecules, 2010, 15, 4, 2600-2608, https://doi.org/10.3390/molecules15042600 . [all data]