6-Hydroxy-3-oxo-α-ionol (Vomifoliol)

Normal alkane RI, non-polar column, temperature ramp

Data compiled by: NIST Mass Spectrometry Data Center, William E. Wallace, director

Column type Capillary
Active phase HP-5 MS
Column length (m) 30.
Carrier gas Helium
Substrate
Column diameter (mm) 0.25
Phase thickness (μm) 0.25
Tstart (C) 70.
Tend (C) 200.
Heat rate (K/min) 3.
Initial hold (min) 2.
Final hold (min) 18.
I 1802.
ReferenceJerkovic, Tuberso, et al., 2010
Comment MSDC-RI

References

Jerkovic, Tuberso, et al., 2010
Jerkovic, I.; Tuberso, C.I.G.; Gugic, M.; Bubalo, D., Composition of Sulla (Hedysarum coronarium L.) honey solvent extractives determined by GC/MS: norisoprenoids and other volatile organic compounds, Molecules, 2010, 15, 9, 6375-6385, https://doi.org/10.3390/molecules15096375 . [all data]