8,9-Epoxycadalene

Normal alkane RI, non-polar column, temperature ramp

View large format table.

Column type Active phase I Reference Comment
CapillaryDB-51676.Ho, Wang, et al., 201030. m/0.25 mm/0.25 μm, Helium, 2. K/min; Tstart: 50. C; Tend: 250. C

References

Ho, Wang, et al., 2010
Ho, C.-L.; Wang, E.I.-C.; Yu, H.-T.; Yu, H.-M.; Su, Y.-C., Composition amd antioxidant activities of essential oils of different tissues from Cryptomeria japonica D. Don, Quarterly J. Chin. Forestry, 2010, 32, 1, 63-76. [all data]