Lactarazulene

Normal alkane RI, non-polar column, temperature ramp

View large format table.

Column type Active phase I Reference Comment
CapillaryRTX-11796.Dib, Djabou, et al., 201060. m/0.22 mm/0.25 μm, Helium, 2. K/min, 230. C @ 30. min; Tstart: 60. C

Normal alkane RI, non-polar column, custom temperature program

View large format table.

Column type Active phase I Reference Comment
CapillaryRTX-11792.Dib, Djabou, et al., 201060. m/0.22 mm/0.25 μm, Helium; Program: not specified

Normal alkane RI, polar column, temperature ramp

View large format table.

Column type Active phase I Reference Comment
CapillaryRTX-Wax2430.Dib, Djabou, et al., 201060. m/0.22 mm/0.25 μm, Helium, 2. K/min, 230. C @ 30. min; Tstart: 60. C

References

Dib, Djabou, et al., 2010
Dib, M.ElA.; Djabou, N.; Desjobert, L.-M.; Allali, H.; Tabti, B.; Muselli, A.; Costa, J., Characterization of volatile compounds of Daucus crinitus Desf. headspace solid phase microextraction as alternative technique to hydrodistillation, Chem, Centr. J., 2010, 4, 16, 1-15. [all data]