Isochavicol 2-methylbutyrate

Normal alkane RI, non-polar column, temperature ramp

Data compiled by: NIST Mass Spectrometry Data Center, William E. Wallace, director

Column type CapillaryCapillary
Active phase RTX-1RTX-1
Column length (m) 60.60.
Carrier gas HeliumHelium
Substrate
Column diameter (mm) 0.220.22
Phase thickness (μm) 0.250.25
Tstart (C) 60.60.
Tend (C) 230.230.
Heat rate (K/min) 2.2.
Initial hold (min)
Final hold (min) 5.30.
I 1651.1651.
ReferenceBendiabdellah, El Amine Dib, et al., 2012Dib, Djabou, et al., 2010
Comment MSDC-RI MSDC-RI

References

Bendiabdellah, El Amine Dib, et al., 2012
Bendiabdellah, A.; El Amine Dib, M.; Djabou, N.; Allali, H.; Tabti, B.; Costa, J.; Myseli, A., Biological activities and volatile cinstituents of Daucus muricatus L. from Algeria, Chem. Centr. J., 2012, 6, 48, 1-22. [all data]

Dib, Djabou, et al., 2010
Dib, M.ElA.; Djabou, N.; Desjobert, L.-M.; Allali, H.; Tabti, B.; Muselli, A.; Costa, J., Characterization of volatile compounds of Daucus crinitus Desf. headspace solid phase microextraction as alternative technique to hydrodistillation, Chem, Centr. J., 2010, 4, 16, 1-15. [all data]