Verbenene

Normal alkane RI, non-polar column, temperature ramp

View large format table.

Column type Active phase I Reference Comment
CapillaryHP-5 MS956.Zouari, Ayadi, et al., 201230. m/0.25 mm/0.25 μm, Helium, 50. C @ 1. min, 7. K/min, 250. C @ 5. min
CapillaryZB-5 MS953.Boix, Victorio, et al., 201030. m/0.25 mm/0.25 μm, Helium, 5. K/min; Tstart: 60. C; Tend: 290. C
CapillarySPB-1946.Neves, Rosa, et al., 201030. m/0.20 mm/0.20 μm, Helium, 3. K/min, 220. C @ 15. min; Tstart: 70. C

Normal alkane RI, polar column, temperature ramp

View large format table.

Column type Active phase I Reference Comment
CapillarySupelcowax-101131.Neves, Rosa, et al., 201030. m/0.20 mm/0.20 μm, Helium, 3. K/min, 220. C @ 15. min; Tstart: 70. C

References

Zouari, Ayadi, et al., 2012
Zouari, N.; Ayadi, I.; Fakhfakh, N.; Rebai, A.; Zouari, S., Variations of chemical composition of essential oils in wild-populations of Thymus algeriensis Boiss et Reut., a North African endemic species, Lipids in Health and Desease, 2012, 11, 1, 28-39, https://doi.org/10.1186/1476-511X-11-28 . [all data]

Boix, Victorio, et al., 2010
Boix, V.F.; Victorio, C.P.; Lage, C.L.S.; Kuster, R.M., Volatile compounds from Rosmarinus officinalis L. and Baccharis dracunculifolia DC. growing in Southeast coast of Brasil, Quim. Nova, 2010, 33, 2, 255-257, https://doi.org/10.1590/S0100-40422010000200004 . [all data]

Neves, Rosa, et al., 2010
Neves, A.; Rosa, S.; Goncalves, J.; Rufino, A.; Judas, F.; Salgueiro, L.; Lopes, M.C.; Cavaleiro, C.; Mendes, A.F., Screening of five essential oils for identification of potential inhibitors of IL-1-unduced Nf-kB activation and NO production in human clondrocytes: characterization of the inhibitory activity of alpha-pinene, Plante Med., 2010, 76, 03, 303-308, https://doi.org/10.1055/s-0029-1186085 . [all data]