2-(Sulfanylmethyl)hexan-1-ol

Normal alkane RI, polar column, custom temperature program

Data compiled by: NIST Mass Spectrometry Data Center, William E. Wallace, director

Column type Capillary
Active phase FFAP
Column length (m) 25.
Carrier gas Nitrogen
Substrate
Column diameter (mm) 0.32
Phase thickness (μm) 0.30
Program 36 0C 20 0C/min -> 85 0C 1 0C/min -> 145 0C 3 0C/min -> 250 0C
I 1985.
ReferenceBailly and Collin, 2010
Comment MSDC-RI

Normal alkane RI, non-polar column, custom temperature program

View large format table.

Column type Active phase I Reference Comment
CapillaryCP Sil-5 CB1217.Bailly and Collin, 201050. m/0.32 mm/1.20 μm, Nitrogen; Program: 36 0C 20 0C/min -> 85 0C 1 0C/min -> 145 0C 3 0C/min -> 250 0C

References

Bailly and Collin, 2010
Bailly, S.; Collin, S., Fate of polyunsaturated thiols in sauternes wines through ageing in Expression of Multidisciplinary Flavour Sci., Blank, I.; Wust, M.; Yertzian, C., ed(s)., Zhaw Ed., 2010, 227-230, retrieved from https://home.zhaw.ch/tildayere/pdf/Teil58-Expression of Multidisciplinary.pdf. [all data]