trans-α-(Z)-Bergamotol

Normal alkane RI, non-polar column, temperature ramp

Data compiled by: NIST Mass Spectrometry Data Center, William E. Wallace, director

Column type Capillary
Active phase Elite-5 MS
Column length (m) 30.
Carrier gas Helium
Substrate
Column diameter (mm) 0.25
Phase thickness (μm) 0.25
Tstart (C) 40.
Tend (C) 220.
Heat rate (K/min) 4.
Initial hold (min)
Final hold (min)
I 1606.
ReferenceBaharum, Bunawan, et al., 2010
Comment MSDC-RI

References

Baharum, Bunawan, et al., 2010
Baharum, S.N.; Bunawan, H.; Ghani, M.A.; Mustafa, W.A.W.; Noor, N.M., Analysis of the chemical composition of the essential oil of Polygonum minus Huds. using two-dimensional gas chromatography - time of flight mass spectrometry (GC-TOF-MS), Molecules, 2010, 15, 10, 7006-7015, https://doi.org/10.3390/molecules15107006 . [all data]