α-cis-Bergamotene

Normal alkane RI, non-polar column, temperature ramp

View large format table.

Column type Active phase I Reference Comment
CapillaryDB-51414.Magalhaes, Lima, et al., 201030. m/0.25 mm/0.25 μm, Helium, 3. K/min; Tstart: 60. C; Tend: 240. C

Normal alkane RI, non-polar column, custom temperature program

View large format table.

Column type Active phase I Reference Comment
CapillaryHP-5 MS1440.Bagci, Yazgin, et al., 201030. m/0.25 mm/0.25 μm, Helium; Program: 70 0C (2 min) 10 0C/min -> 150 0C (15 min) 5 0C/min -> 240 0C

References

Magalhaes, Lima, et al., 2010
Magalhaes, L.A.M.; Lima, M. daP.; Marques, M.O.M.; Facanali, R.; Pinto, A.C. daS.; Tadei, W.P., Chemical composition and larvicidal activity against Aedes aegypti Larvae of essential oils from four Guarea species, Molecules, 2010, 15, 8, 5734-5741, https://doi.org/10.3390/molecules15085734 . [all data]

Bagci, Yazgin, et al., 2010
Bagci, E.; Yazgin, A.; Hayta, S.; Cakilcioglu, U., Composition of the essential oil of Teucrium chamaedrys L. (Lamiaceae) from Turkey, J. Med. Plants Res., 2010, 4, 23, 2588-2590. [all data]