trans-α,α,5-Trimethyl-5-ethenyltetrahydro-2-furanmethanol

Normal alkane RI, non-polar column, custom temperature program

Data compiled by: NIST Mass Spectrometry Data Center, William E. Wallace, director

Column type Capillary
Active phase OV-1
Column length (m) 30.
Carrier gas Helium
Substrate
Column diameter (mm) 0.25
Phase thickness (μm)
Program 40 0C 2 0C/min -> 130 0C (5 min) 10 0C/min -> 230 0C (15 min)
I 1047.
ReferenceYu, Li, et al., 2009
Comment MSDC-RI

References

Yu, Li, et al., 2009
Yu, L.-F.; Li, X.-R.; Liu, S.-Y.; Xu, G.-W.; Liang, Y.-Z., Comparative analysis of essential components between the herbal pair Radix Saposhnikoviae-Rhizoma seu Radix Notopterygii and its single herbs by GC-MS combined with a chemometric resolution method, Anal. Methods, 2009, 1, 1, 45-51, https://doi.org/10.1039/b9ay00044e . [all data]