Epoxybulnesene

Normal alkane RI, non-polar column, temperature ramp

View large format table.

Column type Active phase I Reference Comment
CapillaryHP-11573.Wetwiayaklung, Thavanapong, et al., 200925. m/0.32 mm/0.17 μm, 50. C @ 5. min, 1. K/min, 260. C @ 5. min

Normal alkane RI, non-polar column, custom temperature program

View large format table.

Column type Active phase I Reference Comment
CapillaryHP-11572.Wetwiayaklung, Thavanapong, et al., 200925. m/0.32 mm/0.17 μm; Program: not specified

References

Wetwiayaklung, Thavanapong, et al., 2009
Wetwiayaklung, P.; Thavanapong, N.; Charoenteeraboon, J., Chemical constituents and antimicrobial activity os essential oil and extracts of heartwood of Aquilaria crassna obtained from water distillation and supercritical fluid carbon dioxide extraction, Silpakorn U Sci. J., 2009, 3, 1, 25-33. [all data]