Caryophylle-4(12),8(13)-dien-5β-ol

Normal alkane RI, non-polar column, temperature ramp

Data compiled by: NIST Mass Spectrometry Data Center, William E. Wallace, director

Column type CapillaryCapillary
Active phase DB-5 MSDB-5
Column length (m) 25.30.
Carrier gas HeliumHelium
Substrate
Column diameter (mm) 0.300.25
Phase thickness (μm) 0.250.25
Tstart (C) 50.40.
Tend (C) 240.240.
Heat rate (K/min) 3.3.
Initial hold (min)  1.
Final hold (min)
I 1641.1590.
ReferenceChalchat, Figueredo, et al., 2010de Souza, Lopes, et al., 2009
Comment MSDC-RI MSDC-RI

References

Chalchat, Figueredo, et al., 2010
Chalchat, J.-C.; Figueredo, G.; Ozcan, M.M.; Unver, A., Effect of hydrodistillation and microwave distillation extraction methods on chemical composition of essential oil of pickling herb and myrtle plants, South Western J. of Agriculture, 2010, 1, 2, 133-141. [all data]

de Souza, Lopes, et al., 2009
de Souza, A.; Lopes, E.M.C.; da Silva, M.C.; Cordeiro, I.; Young, M.C.M.; Sobral, M.E.G.; Moreno, P.R.H., Chemical composition and acetylcholinesterase inhibitory activity of essential oils of Myrceugenia myrcioides (Chambess.) O. Berg and Eugenia riedeliana O. Berg, Myrtaceae, Braz. J. Pharmacognosy, 2009, 20, 2, 175-179. [all data]