trans-Piperitenone oxide

Normal alkane RI, non-polar column, temperature ramp

View large format table.

Column type Active phase I Reference Comment
CapillaryDB-51371.Soleimani and Azar, 200930. m/0.25 mm/0.25 μm, Nitrogen, 60. C @ 3. min, 5. K/min, 220. C @ 5. min

References

Soleimani and Azar, 2009
Soleimani, M.; Azar, P.A., Volatile composition of Ruta graveolens L. of North of Iran, World Appl. Sci. J., 2009, 7, 1, 124-126. [all data]