cis-Linalool oxide (furan)

Normal alkane RI, non-polar column, temperature ramp

Data compiled by: NIST Mass Spectrometry Data Center, William E. Wallace, director

Column type Capillary
Active phase BP-1
Column length (m) 50.
Carrier gas Helium
Substrate
Column diameter (mm) 0.22
Phase thickness (μm) 0.25
Tstart (C) 60.
Tend (C) 220.
Heat rate (K/min) 2.
Initial hold (min)
Final hold (min) 20.
I 1058.
ReferenceOttavioli, Bighelli, et al., 2009
Comment MSDC-RI

References

Ottavioli, Bighelli, et al., 2009
Ottavioli, J.; Bighelli, A.; Casanova, J.; Bang, B.T.; Y., GC (retention indices), GC-MS, and 13C NMR of two citral-rich Cymbopogon leaf oils: C. Flexuosus and C. tortilis, Spectroscopy Lett., 2009, 42, 8, 506-512, https://doi.org/10.1080/00387010903022350 . [all data]