β-Bergamotene

Normal alkane RI, non-polar column, temperature ramp

Data compiled by: NIST Mass Spectrometry Data Center, William E. Wallace, director

Column type CapillaryCapillary
Active phase DB-5HP-5
Column length (m) 30.25.
Carrier gas HeliumHelium
Substrate
Column diameter (mm) 0.250.20
Phase thickness (μm) 0.250.33
Tstart (C) 60.60.
Tend (C) 240.240.
Heat rate (K/min) 3.3.
Initial hold (min)
Final hold (min)  7.
I 1436.1435.
ReferenceKarimi, Farmani, et al., 2011Maridass, 2009
Comment MSDC-RI MSDC-RI

References

Karimi, Farmani, et al., 2011
Karimi, H.; Farmani, A.; Nourizadeh, H., A performance comparison of modern statistical technique for molecular descriptor selection and retention prediction of essential oil from leaves, Amer. J. Sci. Res., 2011, 38, 36-40. [all data]

Maridass, 2009
Maridass, M., Inter-generic relationships of Ocimum and Origanum based on GC-MS volatile oils data using software NTSPSpc version 2.0, Ethnobotanical Leaflets, 2009, 13, 83-88. [all data]