4-Mercaptopentan-2-ol

Normal alkane RI, non-polar column, custom temperature program

View large format table.

Column type Active phase I Reference Comment
CapillaryCP-Sil 5 CB926.Liu, Cao, et al., 2009Column length: 50. m; Column diameter: 0.32 mm; Program: not specified

References

Liu, Cao, et al., 2009
Liu, F.; Cao, C.; Li, X., Quantitative structure-retention relationship study of mercapto-compounds by the method of dividing the molecular structure into substructure, QSAR Comb. Sci., 2009, 28, 11-12, 1358-1366, https://doi.org/10.1002/qsar.200960043 . [all data]