3-Mercapto-2-methylpentanol

Normal alkane RI, non-polar column, custom temperature program

Data compiled by: NIST Mass Spectrometry Data Center, William E. Wallace, director

Column type Capillary
Active phase CP-Sil 5 CB
Column length (m) 50.
Carrier gas
Substrate
Column diameter (mm) 0.32
Phase thickness (μm)
Program not specified
I 1084.
ReferenceLiu, Cao, et al., 2009
Comment MSDC-RI

References

Liu, Cao, et al., 2009
Liu, F.; Cao, C.; Li, X., Quantitative structure-retention relationship study of mercapto-compounds by the method of dividing the molecular structure into substructure, QSAR Comb. Sci., 2009, 28, 11-12, 1358-1366, https://doi.org/10.1002/qsar.200960043 . [all data]