cis-Linalool oxide (pyranoid)

Normal alkane RI, non-polar column, temperature ramp

Data compiled by: NIST Mass Spectrometry Data Center, William E. Wallace, director

Column type CapillaryCapillary
Active phase HP-5 MSDB-5
Column length (m) 30.30.
Carrier gas HeliumHelium
Substrate
Column diameter (mm) 0.250.25
Phase thickness (μm) 0.250.25
Tstart (C) 70.50.
Tend (C) 290.250.
Heat rate (K/min) 5.5.
Initial hold (min)  2.
Final hold (min) 10.
I 1173.1174.
ReferenceRadulovic, Blagojevic, et al., 2010Ho, Wang, et al., 2009
Comment MSDC-RI MSDC-RI

References

Radulovic, Blagojevic, et al., 2010
Radulovic, N.; Blagojevic, P.; Palic, R., Comparative study of the leaf volatiles of Arctostaphylos uva-ursi (L.) Spreng. and Vaccinium vitis-idaea L. (Ericaceae), Molecules, 2010, 15, 9, 6168-6185, https://doi.org/10.3390/molecules15096168 . [all data]

Ho, Wang, et al., 2009
Ho, C.-L.; Wang, E.I.-C.; Su, Y.-C., Essential oil compositions and bioactivities of the various parts of Cinnamomum camphora Sieb. var. linallolifera Fujuta, Journal title only in Chinese, 2009, 31, 2, 77-96. [all data]